{"text_format":"1","workbook":"xlsx","n_sheets":3,"sheets":["入力シート","　　　　印刷シート　　　　","Sheet2"],"not_rendered":{"charts":0,"images":0,"macros":1,"external_links":0,"defined_names":1,"comments":0,"pivot_tables":0},"unopened":[],"bounds":{"document_bytes":16777216,"sheet_cells":100000,"rows_first":2000,"rows_last":500,"rows_between":2000,"halvings":0,"cell_chars":16384,"cell_head_chars":4096},"cells_cut":0,"cells_raw":0,"read":"whole","date_system":"1900"}

{"sheet":"入力シート","index":0,"n_rows":135,"n_cols":98,"rows_kept":135,"cut":false,"hidden":false,"merged":[[93,87,96,98],[97,87,102,98],[109,43,109,46],[109,51,109,53],[103,68,105,98],[106,89,108,93],[106,94,108,98],[97,81,99,82],[100,81,102,82],[93,83,93,86],[94,83,96,84],[103,43,108,46],[100,69,102,70],[100,71,102,72],[94,69,96,70],[94,71,96,72],[94,73,96,74],[99,83,99,86],[100,83,102,84],[100,85,102,86],[100,63,102,64],[100,65,102,66],[100,67,102,68],[100,73,102,74],[109,31,109,34],[109,35,109,38],[109,39,109,42],[109,7,109,10],[109,11,109,14],[137,68,137,95],[124,7,126,98],[105,27,108,30],[105,31,108,34],[122,58,123,62],[122,63,123,98],[109,89,109,93],[109,94,109,98],[109,54,109,56],[109,57,109,59],[109,60,109,63],[109,64,109,67],[110,41,112,42],[110,43,112,44],[110,45,112,46],[110,47,112,65],[112,8,121,9],[113,21,118,98],[114,12,115,19],[116,12,117,19],[119,21,121,98],[120,12,121,19],[110,29,112,30],[110,31,112,32],[110,33,112,34],[110,35,112,36],[110,37,112,38],[110,39,112,40],[110,11,112,20],[110,21,112,22],[110,23,112,24],[110,25,112,26],[110,27,112,28],[109,15,109,18],[109,19,109,22],[109,23,109,26],[109,27,109,30],[106,51,108,53],[100,31,102,32],[100,33,102,34],[103,51,105,67],[106,64,108,67],[106,54,108,56],[106,57,108,59],[106,60,108,63],[97,50,102,51],[97,52,98,62],[97,63,98,80],[100,75,102,76],[100,77,102,78],[100,79,102,80],[100,43,102,44],[100,45,102,46],[100,52,102,62],[99,43,99,46],[99,52,99,62],[99,63,99,80],[97,41,99,42],[99,12,99,22],[100,35,102,36],[100,37,102,38],[100,39,102,40],[100,41,102,42],[99,23,99,40],[79,7,102,9],[79,10,84,11],[91,10,96,11],[91,12,92,22],[91,23,92,40],[91,41,93,42],[79,12,80,22],[79,23,80,40],[81,12,81,22],[81,23,81,40],[82,31,84,32],[88,27,90,28],[87,23,87,40],[93,12,93,22],[93,23,93,40],[94,37,96,38],[94,12,96,22],[103,8,108,9],[103,11,108,14],[103,15,108,18],[103,19,108,22],[103,23,108,26],[103,27,104,34],[100,12,102,22],[100,23,102,24],[100,25,102,26],[100,27,102,28],[100,29,102,30],[97,10,102,11],[97,12,98,22],[97,23,98,40],[88,12,90,22],[88,23,90,24],[88,37,90,38],[94,23,96,24],[94,25,96,26],[94,27,96,28],[94,29,96,30],[94,31,96,32],[94,33,96,34],[94,35,96,36],[88,33,90,34],[88,35,90,36],[91,81,93,82],[94,77,96,78],[94,79,96,80],[94,81,96,82],[93,63,93,80],[94,75,96,76],[94,45,96,46],[94,52,96,62],[94,63,96,64],[94,65,96,66],[94,67,96,68],[88,69,90,70],[88,71,90,72],[88,39,90,40],[88,41,90,42],[88,43,90,44],[88,45,90,46],[88,52,90,62],[88,63,90,64],[94,39,96,40],[94,41,96,42],[93,43,93,46],[93,52,93,62],[91,63,92,80],[88,83,90,84],[87,63,87,80],[88,77,90,78],[88,79,90,80],[88,81,90,82],[87,83,87,86],[85,10,90,11],[85,12,86,22],[85,23,86,40],[85,41,87,42],[85,50,90,51],[85,63,86,80],[88,85,90,86],[88,73,90,74],[88,75,90,76],[79,47,102,49],[79,50,84,51],[79,52,80,62],[87,52,87,62],[85,52,86,62],[88,25,90,26],[91,50,96,51],[88,65,90,66],[88,67,90,68],[82,45,84,46],[82,52,84,62],[82,63,84,64],[82,65,84,66],[82,33,84,34],[82,35,84,36],[82,37,84,38],[82,39,84,40],[82,41,84,42],[82,43,84,44],[82,12,84,22],[82,23,84,24],[82,25,84,26],[82,27,84,28],[82,29,84,30],[87,12,87,22],[88,29,90,30],[88,31,90,32],[73,97,74,98],[81,63,81,80],[81,83,81,86],[79,63,80,80],[79,81,81,82],[79,41,81,42],[75,54,78,63],[73,64,75,70],[76,64,78,70],[75,71,75,80],[76,71,77,80],[75,88,75,98],[76,88,77,98],[73,81,75,87],[79,87,81,98],[73,41,76,42],[75,43,76,46],[77,41,78,42],[77,43,78,44],[77,45,78,46],[81,43,81,46],[81,52,81,62],[73,12,74,22],[73,23,74,40],[73,47,78,53],[73,62,74,63],[77,23,78,24],[77,12,78,22],[77,25,78,26],[77,27,78,28],[75,12,76,22],[75,23,76,40],[77,29,78,30],[77,31,78,32],[77,33,78,34],[77,35,78,36],[77,37,78,38],[77,39,78,40],[70,97,71,98],[68,49,69,51],[70,13,72,19],[70,28,71,29],[70,30,72,36],[70,42,71,43],[70,47,71,48],[71,20,72,27],[71,37,72,41],[71,44,72,46],[71,49,72,51],[67,52,68,53],[67,54,69,63],[67,64,69,70],[67,71,69,80],[67,81,69,96],[67,97,68,98],[67,47,68,48],[68,37,69,41],[68,44,69,46],[70,52,71,53],[70,54,72,63],[70,64,72,70],[70,71,72,80],[50,97,51,98],[52,7,54,29],[52,30,54,52],[52,53,54,75],[52,76,54,98],[64,81,66,87],[64,97,65,98],[65,20,66,27],[65,37,66,44],[65,54,66,61],[65,71,66,78],[65,88,66,96],[55,7,56,12],[57,7,63,98],[64,7,66,12],[64,13,66,19],[64,28,65,29],[64,30,66,36],[64,45,65,46],[64,47,66,53],[64,62,65,63],[64,64,66,70],[64,79,65,80],[50,74,51,75],[45,59,46,61],[45,63,46,65],[45,72,46,74],[45,77,46,80],[47,87,47,92],[47,93,47,98],[48,7,49,29],[48,30,49,52],[48,53,49,75],[48,76,49,98],[47,44,47,47],[47,48,47,52],[47,53,47,56],[47,57,47,61],[47,62,47,65],[47,66,47,74],[47,75,47,80],[47,81,47,86],[46,3,104,5],[47,7,47,11],[47,12,47,16],[47,17,47,20],[47,21,47,34],[47,35,47,39],[47,40,47,43],[45,50,46,52],[45,54,46,56],[50,7,51,9],[50,28,51,29],[50,51,51,52],[67,7,72,12],[67,13,69,19],[67,20,69,29],[67,30,69,36],[67,42,68,43],[45,7,46,11],[45,12,46,16],[45,33,46,34],[45,37,46,39],[45,41,46,43],[45,45,46,47],[73,7,78,11],[41,93,42,98],[40,7,41,20],[43,67,44,73],[43,75,44,86],[43,87,44,92],[43,93,44,98],[43,57,44,65],[33,90,34,91],[33,97,34,98],[33,59,34,60],[33,71,34,72],[33,78,34,79],[33,80,34,81],[39,67,40,73],[39,78,40,89],[39,93,40,98],[36,80,38,98],[39,42,40,58],[33,46,34,47],[33,52,34,53],[33,7,38,22],[33,23,34,25],[33,27,34,28],[33,33,34,34],[6,13,7,39],[30,80,32,98],[24,66,25,98],[18,81,20,82],[18,83,20,84],[18,85,20,86],[18,87,20,88],[18,89,20,90],[18,91,20,92],[16,17,29,56],[16,68,17,98],[26,60,29,98],[18,57,20,74],[16,57,17,67],[21,57,23,63],[21,64,23,98],[18,93,20,94],[18,95,20,96],[18,97,20,98],[17,7,21,12],[17,13,28,16],[18,75,20,76],[18,77,20,78],[18,79,20,80],[0,17,5,20],[0,21,5,40],[0,10,5,16],[30,7,32,22],[30,23,32,41],[23,7,24,12],[24,60,25,65],[24,57,29,59],[1,77,3,99],[11,8,14,11],[11,48,12,49],[11,54,12,62],[11,69,12,70],[11,73,12,80],[11,86,12,87],[12,13,13,43],[13,47,15,67],[13,68,15,84],[13,85,15,98],[33,40,34,41],[33,42,34,43],[36,23,38,41],[36,42,38,60],[36,61,38,79],[30,42,32,60],[30,61,32,79],[26,7,27,12],[106,85,108,88],[106,68,108,84],[42,7,43,14],[42,23,43,32],[43,17,44,20],[43,35,44,43],[43,44,44,56],[40,23,41,32],[41,44,42,56],[41,67,42,73],[41,78,42,89],[70,81,72,96],[73,79,74,80],[45,85,46,86],[45,91,46,92],[45,96,46,98],[109,85,109,88],[109,68,109,84],[103,35,108,38],[103,39,108,42],[103,47,109,50],[78,88,78,98],[78,71,78,80],[76,81,78,87],[87,43,87,46],[82,71,84,72],[82,73,84,74],[82,75,84,76],[82,77,84,78],[82,83,84,84],[82,85,84,86],[82,79,84,80],[82,81,84,82],[82,87,92,98],[82,67,84,68],[82,69,84,70],[85,81,87,82],[94,43,96,44],[91,52,92,62],[94,85,96,86]]}
[null,null,null,null,null,null,null,null,null,null,"令和",null,null,null,null,null,null,5,null,null,null,"年度 給与支払報告書"]
[null,null,null,null,null,null,null,null,null,null,null,null,null,null,null,null,null,null,null,null,null,null,null,null,null,null,null,null,null,null,null,null,null,null,null,null,null,null,null,null,null,null,null,null,null,null,null,null,null,null,null,null,null,null,null,null,null,null,null,null,null,null,null,null,null,null,null,null,null,null,null,null,null,null,null,null,null,"印刷は　↓の「印刷」ボタンでおねがいします"]
[]
[]
[]
[]
[]
[]
[]
[]
[]
[null,null,null,null,null,null,null,null,{"$f":"IF(R1=\"\",\"\",R1)","v":5}]
[null,null,null,null,null,null,null,null,null,null,null,null,null,"給与支払報告書（個人別明細書）"]
[]
[]
{"$rows_left_out":121}
{"sheet":"　　　　印刷シート　　　　","index":1,"n_rows":82,"n_cols":57,"rows_kept":82,"cut":false,"hidden":false,"merged":[[58,92,60,98],[59,91,60,91],[56,90,58,91],[49,92,57,98],[64,70,65,70],[64,71,65,71],[64,72,65,72],[64,73,65,73],[64,77,65,79],[61,72,63,73],[61,92,65,98],[64,89,65,89],[64,90,65,90],[64,91,65,91],[62,77,63,79],[62,80,63,88],[64,81,65,81],[64,82,65,82],[61,89,63,89],[59,88,60,88],[59,89,60,89],[64,87,65,87],[59,90,60,90],[59,83,60,83],[64,69,65,69],[64,83,65,83],[64,84,65,84],[59,59,60,61],[59,70,60,70],[59,71,60,71],[59,72,60,72],[59,73,60,73],[59,77,60,79],[62,59,63,61],[62,62,63,70],[64,59,65,61],[61,77,61,79],[64,66,65,66],[64,67,65,67],[64,68,65,68],[61,76,65,76],[61,80,61,88],[64,86,65,86],[64,80,65,80],[59,81,60,81],[59,82,60,82],[64,88,65,88],[64,85,65,85],[59,62,60,62],[59,84,60,84],[51,59,51,61],[51,62,51,70],[51,71,53,71],[51,72,53,73],[51,76,55,76],[51,77,51,79],[51,80,51,88],[54,66,55,66],[54,67,55,67],[54,68,55,68],[54,69,55,69],[54,86,55,86],[54,87,55,87],[54,80,55,80],[54,81,55,81],[54,82,55,82],[54,83,55,83],[54,84,55,84],[54,85,55,85],[54,63,55,63],[51,89,53,89],[51,90,53,91],[52,59,53,61],[52,62,53,70],[54,91,55,91],[46,74,65,75],[46,76,50,76],[46,77,46,79],[46,80,46,88],[49,62,50,62],[49,63,50,63],[49,64,50,64],[49,91,50,91],[61,90,63,91],[52,77,53,79],[52,80,53,88],[54,59,55,61],[54,70,55,70],[54,71,55,71],[54,72,55,72],[54,73,55,73],[54,77,55,79],[54,88,55,88],[54,65,55,65],[56,58,60,58],[56,59,56,61],[56,62,56,70],[56,71,58,71],[56,72,58,73],[56,76,60,76],[56,77,56,79],[56,80,56,88],[56,89,58,89],[59,63,60,63],[59,64,60,64],[59,65,60,65],[59,66,60,66],[59,67,60,67],[59,68,60,68],[59,69,60,69],[59,80,60,80],[59,85,60,85],[59,86,60,86],[59,87,60,87],[57,59,58,61],[57,62,58,70],[57,77,58,79],[57,80,58,88],[54,89,55,89],[54,90,55,90],[47,59,48,61],[47,62,48,70],[47,77,48,79],[47,80,48,88],[49,77,50,79],[49,88,50,88],[49,89,50,89],[49,90,50,90],[49,80,50,80],[49,81,50,81],[49,82,50,82],[49,65,50,65],[49,66,50,66],[49,67,50,67],[49,68,50,68],[49,69,50,69],[49,83,50,83],[49,84,50,84],[49,85,50,85],[49,86,50,86],[49,87,50,87],[54,64,55,64],[46,89,48,89],[46,90,48,91],[46,92,48,98],[41,62,41,70],[44,62,45,62],[44,63,45,63],[44,64,45,64],[44,65,45,65],[44,66,45,66],[44,67,45,67],[44,68,45,68],[44,69,45,69],[41,71,43,71],[41,95,43,98],[44,95,45,98],[41,72,43,73],[41,74,45,78],[41,79,45,81],[42,62,43,70],[44,70,45,70],[44,71,45,71],[44,72,45,72],[44,73,45,73],[30,56,40,98],[8,88,9,98],[21,83,21,84],[22,96,24,97],[21,85,24,86],[22,68,24,69],[1,82,2,89],[1,90,2,98],[1,56,2,56],[1,57,2,57],[1,58,2,58],[1,59,2,59],[1,60,2,60],[1,61,2,61],[1,62,2,62],[1,63,2,63],[1,64,2,64],[1,65,2,65],[1,66,2,66],[1,67,2,67],[1,68,2,68],[1,69,2,69],[80,36,80,46],[8,33,9,35],[8,36,9,46],[10,33,12,46],[66,9,69,10],[66,11,66,14],[67,11,69,12],[67,13,69,14],[66,23,66,32],[67,23,69,24],[67,25,69,26],[67,27,69,28],[67,29,69,30],[67,41,69,42],[67,43,69,44],[67,45,69,46],[22,23,24,24],[27,15,28,23],[61,40,65,46],[58,40,60,46],[59,28,60,28],[67,31,69,32],[66,33,66,46],[73,18,74,18],[0,22,0,29],[0,30,0,37],[0,4,0,21],[0,38,0,46],[66,4,69,4],[66,5,69,6],[66,7,69,7],[66,8,69,8],[66,19,69,20],[49,7,50,9],[54,7,55,9],[59,7,60,9],[64,7,65,9],[49,25,50,27],[54,25,55,27],[59,25,60,27],[54,36,55,36],[64,25,65,27],[22,28,24,29],[39,15,40,18],[44,12,45,12],[44,13,45,13],[44,14,45,14],[44,20,45,20],[73,6,74,9],[73,10,74,10],[73,11,74,11],[59,20,60,20],[59,21,60,21],[64,19,65,19],[64,20,65,20],[64,21,65,21],[59,10,60,10],[59,11,60,11],[59,12,60,12],[59,13,60,13],[59,14,60,14],[59,15,60,15],[59,16,60,16],[70,17,72,18],[70,19,72,20],[61,19,63,19],[66,15,69,16],[66,17,69,18],[66,21,72,22],[61,10,61,18],[62,10,63,18],[61,20,63,21],[35,39,36,42],[35,7,36,10],[35,15,36,18],[44,11,45,11],[39,11,40,13],[37,19,38,20],[39,35,40,38],[39,31,40,34],[39,19,40,20],[39,22,40,23],[39,25,40,25],[37,31,38,34],[37,11,38,14],[37,15,38,18],[37,35,38,38],[37,39,38,45],[39,39,40,45],[44,18,45,18],[44,19,45,19],[41,27,45,29],[35,27,36,29],[35,31,36,34],[47,25,48,27],[47,28,48,36],[22,21,24,22],[22,26,24,27],[35,35,36,37],[35,43,36,45],[27,26,28,34],[27,37,28,44],[22,31,24,32],[21,33,24,34],[22,42,24,43],[30,4,34,46],[26,5,26,12],[27,5,28,12],[25,4,25,14],[25,15,25,25],[25,26,25,36],[25,37,25,46],[21,4,21,5],[22,39,24,40],[22,16,24,17],[22,36,24,37],[46,37,48,37],[46,38,48,39],[61,24,65,24],[64,38,65,38],[64,39,65,39],[64,32,65,32],[46,40,48,46],[49,40,57,46],[37,22,38,23],[37,25,38,25],[56,37,58,37],[54,38,55,38],[54,39,55,39],[54,37,55,37],[52,28,53,36],[54,31,55,31],[54,34,55,34],[51,24,55,24],[54,28,55,28],[54,35,55,35],[46,28,46,36],[49,35,50,35],[49,36,50,36],[49,37,50,37],[41,31,43,34],[44,31,45,34],[57,25,58,27],[57,28,58,36],[61,25,61,27],[61,28,61,36],[61,37,63,37],[61,38,63,39],[62,25,63,27],[62,28,63,36],[59,30,60,30],[59,31,60,31],[59,36,60,36],[59,37,60,37],[59,38,60,38],[59,39,60,39],[59,29,60,29],[64,31,65,31],[49,38,50,38],[49,39,50,39],[64,28,65,28],[64,29,65,29],[59,32,60,32],[59,33,60,33],[59,34,60,34],[59,35,60,35],[56,38,58,39],[64,37,65,37],[64,35,65,35],[49,28,50,28],[49,29,50,29],[49,30,50,30],[49,31,50,31],[49,32,50,32],[54,33,55,33],[64,33,65,33],[64,30,65,30],[78,10,79,46],[70,41,72,42],[70,43,72,44],[70,45,72,46],[70,23,72,24],[70,25,72,26],[70,27,72,28],[70,29,72,30],[70,31,72,32],[70,11,72,12],[70,13,72,14],[70,15,72,16],[73,19,74,19],[73,20,74,20],[73,21,74,21],[73,22,74,22],[73,23,74,46],[73,12,74,12],[73,13,74,13],[73,14,74,14],[73,15,74,15],[73,16,74,16],[73,17,74,17],[75,10,77,46],[1,38,2,46],[20,36,20,41],[1,17,2,17],[1,18,2,18],[1,19,2,19],[1,20,2,20],[1,21,2,21],[1,22,2,29],[37,27,38,30],[5,8,12,30],[5,31,6,34],[5,35,6,35],[5,36,6,36],[5,37,6,37],[5,38,6,38],[5,45,6,45],[5,46,6,46],[13,29,13,37],[13,38,13,46],[17,33,20,35],[20,28,20,32],[22,44,24,45],[22,19,24,20],[21,26,21,27],[1,10,2,10],[21,10,24,14],[21,19,21,20],[1,11,2,11],[1,12,2,12],[1,13,2,13],[1,14,2,14],[1,15,2,15],[1,16,2,16],[17,16,19,32],[20,16,20,20],[14,4,16,11],[13,4,13,11],[13,12,13,19],[13,20,13,28],[21,6,21,7],[14,13,16,17],[14,21,16,26],[46,10,46,18],[73,4,80,5],[75,6,77,9],[78,6,80,9],[80,34,80,35],[1,30,2,37],[70,4,72,4],[70,5,72,6],[70,7,72,7],[70,8,72,8],[70,9,72,10],[64,36,65,36],[64,15,65,15],[64,16,65,16],[64,17,65,17],[64,18,65,18],[64,10,65,10],[64,11,65,11],[64,12,65,12],[64,13,65,13],[64,14,65,14],[41,22,45,26],[35,11,36,13],[35,19,36,21],[54,20,55,20],[54,21,55,21],[54,11,55,11],[54,12,55,12],[54,13,55,13],[54,14,55,14],[51,10,51,18],[56,10,56,18],[47,10,48,18],[54,10,55,10],[3,34,4,46],[51,37,53,37],[51,38,53,39],[52,25,53,27],[51,25,51,27],[51,28,51,36],[46,25,46,27],[49,33,50,33],[49,34,50,34],[3,31,4,33],[8,31,12,32],[7,31,7,33],[14,30,16,35],[14,39,16,44],[5,39,6,39],[5,40,6,40],[17,44,20,46],[20,42,20,43],[17,36,19,43],[7,34,7,46],[5,41,6,41],[5,42,6,42],[21,31,21,32],[20,21,20,27],[5,44,6,44],[54,15,55,15],[54,16,55,16],[54,17,55,17],[54,18,55,18],[46,24,50,24],[56,24,60,24],[51,19,53,19],[51,20,53,21],[56,19,58,19],[56,20,58,21],[46,19,48,19],[46,20,48,21],[54,32,55,32],[52,10,53,18],[37,7,38,10],[41,10,41,18],[39,7,40,10],[35,23,36,26],[44,10,45,10],[41,7,41,9],[42,7,43,9],[44,7,45,9],[56,25,56,27],[5,43,6,43],[56,28,56,36],[29,4,29,6],[17,10,20,15],[19,8,20,9],[21,8,24,9],[42,10,43,18],[54,29,55,29],[54,30,55,30],[49,10,50,10],[46,4,65,5],[61,7,61,9],[62,7,63,9],[61,6,65,6],[41,4,45,6],[64,34,65,34],[41,19,43,19],[41,20,43,21],[44,15,45,15],[44,16,45,16],[44,17,45,17],[59,19,60,19],[46,22,65,23],[49,11,50,11],[0,1,2,3],[22,4,24,5],[3,4,12,5],[1,4,2,4],[1,5,2,5],[1,6,2,6],[1,7,2,7],[35,4,36,6],[22,6,24,7],[17,4,18,9],[19,4,20,7],[7,1,38,3],[3,6,12,7],[37,4,40,6],[1,8,2,8],[1,9,2,9],[0,53,2,55],[0,56,0,73],[3,86,4,98],[5,60,12,82],[5,83,6,86],[5,95,6,95],[5,96,6,96],[5,97,6,97],[5,98,6,98],[7,83,7,85],[7,86,7,98],[8,83,12,84],[8,85,9,87],[5,90,6,90],[5,91,6,91],[5,92,6,92],[0,74,0,81],[0,82,0,89],[0,90,0,98],[1,70,2,70],[1,71,2,71],[1,72,2,72],[1,73,2,73],[1,74,2,81],[21,58,21,59],[27,89,28,96],[3,56,12,57],[3,58,12,59],[3,83,4,85],[13,56,13,63],[13,64,13,71],[13,72,13,80],[13,81,13,89],[13,90,13,98],[20,68,20,72],[20,73,20,79],[20,80,20,84],[20,88,20,93],[20,94,20,95],[22,88,24,89],[22,91,24,92],[22,94,24,95],[5,87,6,87],[5,88,6,88],[5,89,6,89],[10,85,12,98],[5,93,6,93],[5,94,6,94],[14,65,16,69],[14,73,16,78],[14,82,16,87],[14,91,16,96],[17,85,20,87],[17,88,19,95],[17,96,20,98],[19,60,20,61],[17,56,18,61],[19,56,20,59],[17,62,20,67],[17,68,19,84],[29,56,29,58],[21,60,24,61],[21,62,24,66],[21,71,21,72],[21,78,21,79],[25,56,25,66],[25,67,25,77],[25,78,25,88],[25,89,25,98],[26,57,26,64],[22,56,24,57],[22,58,24,59],[22,71,24,72],[22,73,24,74],[22,75,24,76],[22,78,24,79],[27,57,28,64],[27,67,28,75],[22,80,24,81],[22,83,24,84],[21,56,21,57],[73,73,74,73],[27,78,28,86],[14,56,16,63],[46,56,65,57],[46,58,50,58],[46,59,46,61],[46,62,46,70],[46,71,48,71],[46,72,48,73],[51,58,55,58],[64,62,65,62],[64,63,65,63],[64,64,65,64],[64,65,65,65],[49,59,50,61],[49,70,50,70],[49,71,50,71],[49,72,50,72],[49,73,50,73],[61,58,65,58],[61,59,61,61],[61,62,61,70],[61,71,63,71],[54,62,55,62],[70,60,72,60],[66,59,69,59],[66,60,69,60],[66,61,69,62],[66,71,69,72],[66,75,66,84],[66,85,66,98],[67,95,69,96],[66,63,66,66],[67,93,69,94],[67,97,69,98],[67,63,69,64],[67,65,69,66],[67,75,69,76],[67,77,69,78],[67,79,69,80],[67,81,69,82],[67,83,69,84],[70,79,72,80],[81,58,82,98],[3,60,4,61],[3,8,4,9],[3,10,4,30],[3,62,4,82],[73,74,74,74],[73,75,74,98],[66,2,79,3],[73,68,74,68],[73,69,74,69],[73,70,74,70],[75,58,77,61],[75,62,77,98],[78,58,80,61],[70,56,72,56],[70,57,72,58],[70,61,72,62],[70,63,72,64],[70,65,72,66],[70,67,72,68],[70,69,72,70],[70,71,72,72],[70,75,72,76],[73,71,74,71],[81,6,82,42],[56,6,60,6],[49,13,50,13],[49,14,50,14],[46,7,46,9],[47,7,48,9],[51,7,51,9],[57,10,58,18],[49,15,50,15],[49,16,50,16],[49,17,50,17],[49,18,50,18],[59,17,60,17],[59,18,60,18],[52,7,53,9],[57,7,58,9],[56,7,56,9],[46,6,50,6],[51,6,55,6],[49,12,50,12],[49,19,50,19],[49,20,50,20],[49,21,50,21],[54,19,55,19],[41,56,45,58],[41,59,41,61],[42,59,43,61],[44,59,45,61],[39,27,40,30],[44,21,45,21],[73,72,74,72],[78,62,79,98],[80,86,80,87],[80,88,80,98],[70,93,72,94],[70,95,72,96],[70,97,72,98],[70,81,72,82],[70,83,72,84],[73,62,74,62],[73,63,74,63],[73,64,74,64],[73,65,74,65],[73,66,74,66],[73,58,74,61],[66,56,69,56],[73,67,74,67],[70,59,72,59],[66,57,69,58],[7,53,38,55],[41,39,43,42],[44,39,45,42],[67,33,69,40],[70,33,72,40],[67,85,69,92],[70,85,72,92],[66,67,69,68],[66,69,69,70],[66,73,72,74],[41,83,43,86],[44,83,45,86],[41,91,43,94],[44,91,45,94],[41,35,43,38],[44,35,45,38],[41,43,43,46],[44,43,45,46],[41,87,43,90],[44,87,45,90],[70,77,72,78],[66,54,79,55],[73,56,80,57]]}
[null,{"$f":"IF(入力シート!R1=\"\",\"\",入力シート!R1)","v":5},null,null,"※",null,null,null,null,null,null,null,null,null,null,null,null,null,null,null,null,null,"※種　　別",null,null,null,null,null,null,null,"※整　理　番　号",null,null,null,null,null,null,null,"※"]
[null,null,null,null,null,null,null,null,null,null,null,null,null,null,null,null,null,null,null,null,null,null,{"$f":"IF(入力シート!AV14=\"\",\"\",入力シート!AV14)","v":""},null,null,null,null,null,null,null,{"$f":"IF(入力シート!BQ14=\"\",\"\",入力シート!BQ14)","v":""},null,null,null,null,null,null,null,{"$f":"IF(入力シート!CH14=\"\",\"\",入力シート!CH14)","v":""}]
[]
[null,null,null,null,"支　払\nを受け\nる　者",null,"住　所",null,"※区分",null,null,null,null,null,null,null,null,null,null,null,null,null,null,null,null,null,null,null,null,null,null,"（受給者番号）",null,null,{"$f":"IF(入力シート!BQ17=\"\",\"\",入力シート!BQ17)","v":""}]
[]
[null,null,null,null,null,null,null,null,{"$f":"IF(入力シート!R17=\"\",\"\",入力シート!R17)","v":""},null,null,null,null,null,null,null,null,null,null,null,null,null,null,null,null,null,null,null,null,null,null,"（個人番号）",null,null,null,{"$f":"IF(入力シート!BX19=\"\",\"\",入力シート!BX19)","v":""},{"$f":"IF(入力シート!BZ19=\"\",\"\",入力シート!BZ19)","v":""},{"$f":"IF(入力シート!CB19=\"\",\"\",入力シート!CB19)","v":""},{"$f":"IF(入力シート!CD19=\"\",\"\",入力シート!CD19)","v":""},{"$f":"IF(入力シート!CF19=\"\",\"\",入力シート!CF19)","v":""},{"$f":"IF(入力シート!CH19=\"\",\"\",入力シート!CH19)","v":""},{"$f":"IF(入力シート!CJ19=\"\",\"\",入力シート!CJ19)","v":""},{"$f":"IF(入力シート!CL19=\"\",\"\",入力シート!CL19)","v":""},{"$f":"IF(入力シート!CN19=\"\",\"\",入力シート!CN19)","v":""},{"$f":"IF(入力シート!CP19=\"\",\"\",入力シート!CP19)","v":""},{"$f":"IF(入力シート!CR19=\"\",\"\",入力シート!CR19)","v":""},{"$f":"IF(入力シート!CT19=\"\",\"\",入力シート!CT19)","v":""}]
[]
[null,"給与支払報告書（個人別明細書）",null,null,null,null,null,null,null,null,null,null,null,null,null,null,null,null,null,null,null,null,null,null,null,null,null,null,null,null,null,"(役職名)",null,null,{"$f":"IF(入力シート!BM22=\"\",\"\",入力シート!BM22)","v":""}]
[null,null,null,null,null,null,null,null,null,null,null,null,null,null,null,null,null,null,null,null,null,null,null,null,null,null,null,null,null,null,null,"氏　名",null,"（フリガナ）",null,null,{"$f":"IF(入力シート!BO25=\"\",\"\",入力シート!BO25)","v":""}]
[]
[null,null,null,null,null,null,null,null,null,null,null,null,null,null,null,null,null,null,null,null,null,null,null,null,null,null,null,null,null,null,null,null,null,{"$f":"IF(入力シート!BI27=\"\",\"\",入力シート!BI27)","v":""}]
[]
[]
[null,null,null,null,"種　　　　　　　　別",null,null,null,null,null,null,null,"支　　払　　金　　額",null,null,null,null,null,null,null,"給与所得控除後の金額（調整控除後）",null,null,null,null,null,null,null,null,"所得控除の額の合計額",null,null,null,null,null,null,null,null,"源　泉　徴　収　税　額"]
[null,null,null,null,{"$f":"IF(入力シート!H34=\"\",\"\",入力シート!H34)","v":"給与・賞与"},null,null,null,null,null,null,null,"内",{"$f":"IF(入力シート!X37=\"\",\"\",入力シート!X37)","v":""},null,null,null,null,"円",null,null,{"$f":"IF(入力シート!AQ37=\"\",\"\",入力シート!AQ37)","v":""},null,null,null,null,null,"円",null,null,{"$f":"IF(入力シート!BJ37=\"\",\"\",入力シート!BJ37)","v":""},null,null,null,null,null,"円",null,"内",{"$f":"IF(入力シート!CC37=\"\",\"\",入力シート!CC37)","v":""},null,null,null,null,null,"円"]
{"$rows_left_out":68}
{"sheet":"Sheet2","index":2,"n_rows":30,"n_cols":12,"rows_kept":30,"cut":false,"hidden":false,"merged":[]}
[null,"課税所得","税率","控除額"]
[null,0,0.05,0,null,"配偶者控除",{"$f":"IF(入力シート!H48=\"\",\"\",380000)","v":""},null,null,null,"旧生命保険料控除",{"$f":"ROUNDUP(IF(入力シート!AL66<=25000,入力シート!AL66,IF(入力シート!AL66<=50000,入力シート!AL66/2+12500,IF(入力シート!AL66<=100000,入力シート!AL66/4+25000,50000))),0)","v":0}]
[null,1949000,0.1,97500,null,"老人控除配偶者",{"$f":"IF(入力シート!R48=\"\",\"\",100000)","v":""},null,null,null,"旧個人年金保険料控除",{"$f":"ROUNDUP(IF(入力シート!CK66<=25000,入力シート!CK66,IF(入力シート!CK66<=50000,入力シート!CK66/2+12500,IF(入力シート!CK66<=100000,入力シート!CK66/4+25000,50000))),0)","v":0}]
[null,3299000,0.2,427500,null,"特定扶養",{"$f":"入力シート!AJ48*630000","v":0},null,null,null,"新生命保険料の金額",{"$f":"ROUNDUP(IF(入力シート!U66<=20000,入力シート!U66,IF(入力シート!U66<=40000,入力シート!U66/2+10000,IF(入力シート!U66<=80000,入力シート!U66/4+20000,40000))),0)","v":0}]
[null,6949000,0.23,636000,null,"同居老人扶養",{"$f":"入力シート!AS48*100000","v":0},null,null,null,"介護医療保険料の金額",{"$f":"ROUNDUP(IF(入力シート!BC66<=20000,入力シート!BC66,IF(入力シート!BC66<=40000,入力シート!BC66/2+10000,IF(入力シート!BC66<=80000,入力シート!BC66/4+20000,40000))),0)","v":0}]
[null,8999000,0.33,1536000,null,"老人扶養",{"$f":"入力シート!AW48*480000","v":0},null,null,null,"新個人年金保険料の金額",{"$f":"ROUNDUP(IF(入力シート!BT66<=20000,入力シート!BT66,IF(入力シート!BT66<=40000,入力シート!BT66/2+10000,IF(入力シート!BT66<=80000,入力シート!BT66/4+20000,40000))),0)","v":0}]
[null,17999000,0.4,2796000,null,"その他扶養",{"$f":"入力シート!BF48*380000","v":0}]
[null,39999000,0.45,4796000,null,"同居特別障害",{"$f":"入力シート!BX48*350000","v":0},null,null,null,"総生命保険料",{"$f":"IF(L15<=120000,L15,120000)","v":0}]
[null,999999999999,null,null,null,"特別障害",{"$f":"入力シート!CD48*400000","v":0}]
[null,null,null,null,null,"その他障害",{"$f":"入力シート!CJ48*270000","v":0},null,null,null,"旧長期損害保険料の金額",{"$f":"ROUNDUP(IF(入力シート!CK76<=10000,入力シート!CK76,IF(入力シート!CK76<=20000,入力シート!CK76/2+5000,15000)),0)","v":0}]
[null,"税額計算用１","税額計算用２",null,null,"本人特別障害",{"$f":"IF(入力シート!AB110=\"\",\"\",400000)","v":""}]
[null,{"$f":"IF(入力シート!AQ37=\"\",\"\",IF((入力シート!AQ37-入力シート!BJ37)<1000,0,(INT((INT((入力シート!AQ37-入力シート!BJ37)/1000)*1000*VLOOKUP(INT((入力シート!AQ37-入力シート!BJ37))/1000*1000,Sheet2!$B$1:$D$9,2,TRUE)-(VLOOKUP(((入力シート!AQ37-入力シート!BJ37))/1000*1000,Sheet2!$B$1:$D$9,3,TRUE)))))-入力シート!BY53))","v":""},null,null,null,"本人その他障害",{"$f":"IF(入力シート!AF110=\"\",\"\",270000)","v":""},null,null,null,"生命保険料控除額",{"$f":"IF(L4=0,L2,IF(L2>40000,L2,IF((L2+L4)>40000,40000,(L2+L4))))","v":0}]
[null,{"$f":"IF(B12<0,0,IF(入力シート!AQ37=\"\",\"\",IF(B12=\"\",\"\",(INT(B12*1.021/100))*100)))","v":""},null,null,null,"寡婦",{"$f":"IF(入力シート!AJ110=\"\",\"\",270000)","v":""},null,null,null,"個人年金保険料控除",{"$f":"IF(L6=0,L3,IF(L3>40000,L3,IF((L3+L6)>40000,40000,(L3+L6))))","v":0}]
[null,null,null,null,null,"特別寡婦",{"$f":"IF(入力シート!AN110=\"\",\"\",350000)","v":""},null,null,null,"介護医療保険料の金額",{"$f":"L5","v":0}]
[null,null,null,null,null,"寡夫",{"$f":"IF(入力シート!AR110=\"\",\"\",270000)","v":""},null,null,null,"合計",{"$f":"IF((SUM(L12:L14))>120000,120000,SUM(L12:L14))","v":0}]
{"$rows_left_out":15}